Reaction Details
TargetNeuropeptide Y receptor type 1
LigandBDBM50296879
Substrate/Competitorn/a
Meas. Tech.ChEMBL_580514 (CHEMBL1053228)
Ki 7.4±n/a nM
Citation Cho, KAndo, MKobayashi, KMiyazoe, HTsujino, TIto, SSuzuki, TTanaka, TTokita, SSato, N Design, synthesis and evaluation of a novel cyclohexanamine class of neuropeptide Y Y1 receptor antagonists. Bioorg Med Chem Lett19:4781-5 (2009) 
 
Neuropeptide Y receptor type 1
Name:Neuropeptide Y receptor type 1
Type:Enzyme Catalytic Domain
Mol. Mass.:44399.07
Organism:Homo sapiens (Human)
Description:NPY-Y1 NPY1R HUMAN::P25929
Residue:384
BDBM50296879
NameBDBM50296879
Synonyms:(4,4-diphenylpiperidin-1-yl)((1R,4R)-4-((R)-1-(4-methoxyphenyl)ethylamino)-2,2-dimethylcyclohexyl)methanone | CHEMBL549851
TypeSmall organic molecule
Emp. Form.C35H44N2O2
Mol. Mass.524.7361
SMILESCOc1ccc(cc1)[C@@H](C)N[C@@H]1CC[C@@H](C(=O)N2CCC(CC2)(c2ccccc2)c2ccccc2)C(C)(C)C1