Reaction Details
TargetSodium-dependent noradrenaline transporter
LigandBDBM50297096
Substrate/Competitorn/a
Meas. Tech.ChEMBL_581595 (CHEMBL1062482)
Ki 9±n/a nM
Citation Fish, PVWakenhut, FRyckmans, TStobie, A Design, synthesis and evaluation of N-[(3S)-pyrrolidin-3-yl]benzamides as selective noradrenaline reuptake inhibitors: CNS penetration in a more polar template. Bioorg Med Chem Lett19:4579-83 (2009) 
 
Sodium-dependent noradrenaline transporter
Name:Sodium-dependent noradrenaline transporter
Type:Multi-pass membrane protein
Mol. Mass.:69337.72
Organism:Homo sapiens (Human)
Description:P23975
Residue:617
BDBM50297096
NameBDBM50297096
Synonyms:(S)-N-cyclopentyl-2-(methylthio)-N-(pyrrolidin-3-yl)benzamide | CHEMBL549510
TypeSmall organic molecule
Emp. Form.C17H24N2OS
Mol. Mass.304.45
SMILESCSc1ccccc1C(=O)N(C1CCCC1)[C@H]1CCNC1