Reaction Details
TargetDelta-type opioid receptor
LigandBDBM50297292
Substrate/Competitorn/a
Meas. Tech.ChEMBL_582956 (CHEMBL1055012)
Ki 2100±n/a nM
Citation Balboni, GTrapella, CSasaki, YAmbo, AMarczak, EDLazarus, LHSalvadori, S Influence of the side chain next to C-terminal benzimidazole in opioid pseudopeptides containing the Dmt-Tic pharmacophore. J Med Chem52:5556-9 (2009) 
 
Delta-type opioid receptor
Name:Delta-type opioid receptor
Type:G Protein-Coupled Receptor (GPCR)
Mol. Mass.:40465.04
Organism:Rattus norvegicus (rat)
Description:Competition binding assays were using CHO-K1 cell membranes expressing the opioid receptor.
Residue:372
BDBM50297292
NameBDBM50297292
Synonyms:(3S,6R,9S,12S)-1H-benzo[d]imidazol-2-yl 1-((S)-2-((S)-2-amino-3-(4-hydroxy-2,6-dimethylphenyl)propanoyl)-1,2,3,4-tetrahydroisoquinolin-3-yl)-12-(4-aminobutyl)-9-benzyl-6-(3-guanidinopropyl)-3-(4-hydroxy-2,6-dimethylbenzyl)-1,4,7,10-tetraoxo-2,5,8,11-tetraazatridecan-13-oate | CHEMBL553221
TypeSmall organic molecule
Emp. Form.C60H74N12O8
Mol. Mass.1091.3052
SMILESCc1cc(O)cc(C)c1C[C@H](N)C(=O)N1Cc2ccccc2C[C@H]1C(=O)N[C@@H](Cc1c(C)cc(O)cc1C)C(=O)N[C@H](CCCN=C(N)N)C(=O)N[C@@H](Cc1ccccc1)C(=O)N[C@@H](CCCCN)C(=O)c1nc2ccccc2[nH]1