Reaction Details
TargetDelta-type opioid receptor
LigandBDBM50297299
Substrate/Competitorn/a
Meas. Tech.ChEMBL_582956 (CHEMBL1055012)
Ki 0.051±n/a nM
Citation Balboni, GTrapella, CSasaki, YAmbo, AMarczak, EDLazarus, LHSalvadori, S Influence of the side chain next to C-terminal benzimidazole in opioid pseudopeptides containing the Dmt-Tic pharmacophore. J Med Chem52:5556-9 (2009) 
 
Delta-type opioid receptor
Name:Delta-type opioid receptor
Type:G Protein-Coupled Receptor (GPCR)
Mol. Mass.:40465.04
Organism:Rattus norvegicus (rat)
Description:Competition binding assays were using CHO-K1 cell membranes expressing the opioid receptor.
Residue:372
BDBM50297299
NameBDBM50297299
Synonyms:(S)-1H-benzo[d]imidazol-2-yl 4-amino-2-((S)-2-((S)-2-amino-3-(4-hydroxy-2,6-dimethylphenyl)propanoyl)-1,2,3,4-tetrahydroisoquinoline-3-carboxamido)-4-oxobutanoate | CHEMBL538699
TypeSmall organic molecule
Emp. Form.C32H34N6O5
Mol. Mass.582.6496
SMILESCc1cc(O)cc(C)c1C[C@H](N)C(=O)N1Cc2ccccc2C[C@H]1C(=O)N[C@@H](CC(N)=O)C(=O)c1nc2ccccc2[nH]1