Reaction Details
TargetMu-type opioid receptor
LigandBDBM50297290
Substrate/Competitorn/a
Meas. Tech.ChEMBL_582957 (CHEMBL1055013)
Ki 0.37±n/a nM
Citation Balboni, GTrapella, CSasaki, YAmbo, AMarczak, EDLazarus, LHSalvadori, S Influence of the side chain next to C-terminal benzimidazole in opioid pseudopeptides containing the Dmt-Tic pharmacophore. J Med Chem52:5556-9 (2009) 
 
Mu-type opioid receptor
Name:Mu-type opioid receptor
Type:G Protein-Coupled Receptor (GPCR)
Mol. Mass.:44503.11
Organism:Rattus norvegicus (rat)
Description:Competition binding assays were carried out using membrane preparations from transfected HN9.10 cells that constitutively expressed the mu opioid receptor.
Residue:398
BDBM50297290
NameBDBM50297290
Synonyms:(S)-1H-benzo[d]imidazol-2-yl 2-((S)-2-((S)-2-amino-3-(4-hydroxy-2,6-dimethylphenyl)propanoyl)-1,2,3,4-tetrahydroisoquinoline-3-carboxamido)-6-(benzyloxycarbonylamino)hexanoate | CHEMBL559088
TypeSmall organic molecule
Emp. Form.C42H46N6O6
Mol. Mass.730.8512
SMILESCc1cc(O)cc(C)c1C[C@H](N)C(=O)N1Cc2ccccc2C[C@H]1C(=O)N[C@@H](CCCCNC(=O)OCc1ccccc1)C(=O)c1nc2ccccc2[nH]1