Reaction Details
TargetDelta-type opioid receptor
LigandBDBM50297321
Substrate/Competitorn/a
Meas. Tech.ChEMBL_583044 (CHEMBL1056543)
Ki 0.530000±n/a nM
Citation Le Bourdonnec, BWindh, RTLeister, LKZhou, QJAjello, CWGu, MChu, GHTuthill, PABarker, WMKoblish, MWiant, DDGraczyk, TMBelanger, SCassel, JAFeschenko, MSBrogdon, BLSmith, SADerelanko, MJKutz, SLittle, PJDeHaven, RNDeHaven-Hudkins, DLDolle, RE Spirocyclic delta opioid receptor agonists for the treatment of pain: discovery of N,N-diethyl-3-hydroxy-4-(spiro[chromene-2,4'-piperidine]-4-yl) benzamide (ADL5747). J Med Chem52:5685-702 (2009) 
 
Delta-type opioid receptor
Name:Delta-type opioid receptor
Type:G Protein-Coupled Receptor (GPCR)
Mol. Mass.:40382.98
Organism:Homo sapiens (Human)
Description:Competition binding assays were carried out using membrane preparations from transfected HN9.10 cells that constitutively expressed the delta opioid receptor.
Residue:372
BDBM50297321
NameBDBM50297321
Synonyms:CHEMBL551613 | Isoindolin-2-yl(4-(spiro[chromene-2,4'-piperidine]-4-yl)phenyl)methanone
TypeSmall organic molecule
Emp. Form.C28H26N2O2
Mol. Mass.422.5182
SMILESO=C(N1Cc2ccccc2C1)c1ccc(cc1)C1=CC2(CCNCC2)Oc2ccccc12