Reaction Details
TargetCytochrome P450 2D6
LigandBDBM50297319
Substrate/Competitorn/a
Meas. Tech.ChEMBL_583050 (CHEMBL1056549)
IC50 4400±n/a nM
Citation Le Bourdonnec, BWindh, RTLeister, LKZhou, QJAjello, CWGu, MChu, GHTuthill, PABarker, WMKoblish, MWiant, DDGraczyk, TMBelanger, SCassel, JAFeschenko, MSBrogdon, BLSmith, SADerelanko, MJKutz, SLittle, PJDeHaven, RNDeHaven-Hudkins, DLDolle, RE Spirocyclic delta opioid receptor agonists for the treatment of pain: discovery of N,N-diethyl-3-hydroxy-4-(spiro[chromene-2,4'-piperidine]-4-yl) benzamide (ADL5747). J Med Chem52:5685-702 (2009) 
 
Cytochrome P450 2D6
Name:Cytochrome P450 2D6
Type:Protein
Mol. Mass.:55774.82
Organism:Homo sapiens (Human)
Description:P10635
Residue:497
BDBM50297319
NameBDBM50297319
Synonyms:CHEMBL550261 | Piperidin-1-yl(4-(spiro[chromene-2,4'-piperidine]-4-yl)phenyl)methanone
TypeSmall organic molecule
Emp. Form.C25H28N2O2
Mol. Mass.388.502
SMILESO=C(N1CCCCC1)c1ccc(cc1)C1=CC2(CCNCC2)Oc2ccccc12