Reaction Details
TargetCytochrome P450 2D6
LigandBDBM50297333
Substrate/Competitorn/a
Meas. Tech.ChEMBL_583050 (CHEMBL1056549)
IC50 5700±n/a nM
Citation Le Bourdonnec, BWindh, RTLeister, LKZhou, QJAjello, CWGu, MChu, GHTuthill, PABarker, WMKoblish, MWiant, DDGraczyk, TMBelanger, SCassel, JAFeschenko, MSBrogdon, BLSmith, SADerelanko, MJKutz, SLittle, PJDeHaven, RNDeHaven-Hudkins, DLDolle, RE Spirocyclic delta opioid receptor agonists for the treatment of pain: discovery of N,N-diethyl-3-hydroxy-4-(spiro[chromene-2,4'-piperidine]-4-yl) benzamide (ADL5747). J Med Chem52:5685-702 (2009) 
 
Cytochrome P450 2D6
Name:Cytochrome P450 2D6
Type:Protein
Mol. Mass.:55774.82
Organism:Homo sapiens (Human)
Description:P10635
Residue:497
BDBM50297333
NameBDBM50297333
Synonyms:CHEMBL562898 | N,N-Diethyl-4-(spiro[chromene-2,4'-piperidine]-4-yl)thiophene-2-carboxamide
TypeSmall organic molecule
Emp. Form.C22H26N2O2S
Mol. Mass.382.519
SMILESCCN(CC)C(=O)c1cc(cs1)C1=CC2(CCNCC2)Oc2ccccc12