Reaction Details
TargetMitogen-activated protein kinase 10
LigandBDBM50297459
Substrate/Competitorn/a
Meas. Tech.ChEMBL_586022 (CHEMBL1063579)
Ki 185±n/a nM
Citation Cao, JGao, HBemis, GSalituro, FLedeboer, MHarrington, EWilke, STaslimi, PPazhanisamy, SXie, XJacobs, MGreen, J Structure-based design and parallel synthesis of N-benzyl isatin oximes as JNK3 MAP kinase inhibitors. Bioorg Med Chem Lett19:2891-5 (2009) 
 
Mitogen-activated protein kinase 10
Name:Mitogen-activated protein kinase 10
Type:Enzyme
Mol. Mass.:52586.89
Organism:Homo sapiens (Human)
Description:n/a
Residue:464
BDBM50297459
NameBDBM50297459
Synonyms:4-bromo-1-((6-fluoro-4H-benzo[d][1,3]dioxin-8-yl)methyl)-3-(hydroxyimino)indolin-2-one | CHEMBL563057
TypeSmall organic molecule
Emp. Form.C17H12BrFN2O4
Mol. Mass.407.191
SMILESFc1cc(CN2C(=O)C(N=O)c3c2cccc3Br)c2OCOCc2c1