Reaction Details
TargetMitogen-activated protein kinase 10
LigandBDBM50297464
Substrate/Competitorn/a
Meas. Tech.ChEMBL_586022 (CHEMBL1063579)
Ki 330±n/a nM
Citation Cao, JGao, HBemis, GSalituro, FLedeboer, MHarrington, EWilke, STaslimi, PPazhanisamy, SXie, XJacobs, MGreen, J Structure-based design and parallel synthesis of N-benzyl isatin oximes as JNK3 MAP kinase inhibitors. Bioorg Med Chem Lett19:2891-5 (2009) 
 
Mitogen-activated protein kinase 10
Name:Mitogen-activated protein kinase 10
Type:Enzyme
Mol. Mass.:52586.89
Organism:Homo sapiens (Human)
Description:n/a
Residue:464
BDBM50297464
NameBDBM50297464
Synonyms:1-((6-fluoro-4H-benzo[d][1,3]dioxin-8-yl)methyl)-3-(hydroxyimino)-6-(trifluoromethyl)indolin-2-one | CHEMBL556721
TypeSmall organic molecule
Emp. Form.C18H12F4N2O4
Mol. Mass.396.2925
SMILESFc1cc(CN2C(=O)C(N=O)c3ccc(cc23)C(F)(F)F)c2OCOCc2c1