Reaction Details
TargetMitogen-activated protein kinase 10
LigandBDBM50297487
Substrate/Competitorn/a
Meas. Tech.ChEMBL_586022 (CHEMBL1063579)
Ki 5800±n/a nM
Citation Cao, JGao, HBemis, GSalituro, FLedeboer, MHarrington, EWilke, STaslimi, PPazhanisamy, SXie, XJacobs, MGreen, J Structure-based design and parallel synthesis of N-benzyl isatin oximes as JNK3 MAP kinase inhibitors. Bioorg Med Chem Lett19:2891-5 (2009) 
 
Mitogen-activated protein kinase 10
Name:Mitogen-activated protein kinase 10
Type:Enzyme
Mol. Mass.:52586.89
Organism:Homo sapiens (Human)
Description:n/a
Residue:464
BDBM50297487
NameBDBM50297487
Synonyms:1-((6-fluoro-4H-benzo[d][1,3]dioxin-8-yl)methyl)-4-(3-fluorophenyl)-3-(hydroxyimino)indolin-2-one | CHEMBL557003
TypeSmall organic molecule
Emp. Form.C23H16F2N2O4
Mol. Mass.422.3809
SMILESFc1cccc(c1)-c1cccc2N(Cc3cc(F)cc4COCOc34)C(=O)C(N=O)c12