Reaction Details
TargetGlycogen synthase kinase-3 beta
LigandBDBM50297455
Substrate/Competitorn/a
Meas. Tech.ChEMBL_586030 (CHEMBL1063587)
Ki>30000±n/a nM
Citation Cao, JGao, HBemis, GSalituro, FLedeboer, MHarrington, EWilke, STaslimi, PPazhanisamy, SXie, XJacobs, MGreen, J Structure-based design and parallel synthesis of N-benzyl isatin oximes as JNK3 MAP kinase inhibitors. Bioorg Med Chem Lett19:2891-5 (2009) 
 
Glycogen synthase kinase-3 beta
Name:Glycogen synthase kinase-3 beta
Type:Enzyme
Mol. Mass.:46756.38
Organism:Homo sapiens (Human)
Description:P49841
Residue:420
BDBM50297455
NameBDBM50297455
Synonyms:1-((6-fluoro-4H-benzo[d][1,3]dioxin-8-yl)methyl)-3-(hydroxyimino)-6-methylindolin-2-one | CHEMBL551140
TypeSmall organic molecule
Emp. Form.C18H15FN2O4
Mol. Mass.342.3211
SMILESCc1ccc2C(N=O)C(=O)N(Cc3cc(F)cc4COCOc34)c2c1