Reaction Details
TargetMitogen-activated protein kinase 14
LigandBDBM50297459
Substrate/Competitorn/a
Meas. Tech.ChEMBL_586023 (CHEMBL1063580)
Ki>10000±n/a nM
Citation Cao, JGao, HBemis, GSalituro, FLedeboer, MHarrington, EWilke, STaslimi, PPazhanisamy, SXie, XJacobs, MGreen, J Structure-based design and parallel synthesis of N-benzyl isatin oximes as JNK3 MAP kinase inhibitors. Bioorg Med Chem Lett19:2891-5 (2009) 
 
Mitogen-activated protein kinase 14
Name:Mitogen-activated protein kinase 14
Type:Serine/threonine-protein kinase
Mol. Mass.:41286.76
Organism:Homo sapiens (Human)
Description:Q16539
Residue:360
BDBM50297459
NameBDBM50297459
Synonyms:4-bromo-1-((6-fluoro-4H-benzo[d][1,3]dioxin-8-yl)methyl)-3-(hydroxyimino)indolin-2-one | CHEMBL563057
TypeSmall organic molecule
Emp. Form.C17H12BrFN2O4
Mol. Mass.407.191
SMILESFc1cc(CN2C(=O)C(N=O)c3c2cccc3Br)c2OCOCc2c1