Reaction Details
TargetcGMP-specific 3',5'-cyclic phosphodiesterase
LigandBDBM50297805
Substrate/Competitorn/a
Meas. Tech.ChEMBL_584078 (CHEMBL1058319)
IC50 2.7±n/a nM
Citation Owen, DRWalker, JKJon Jacobsen, EFreskos, JNHughes, ROBrown, DLBell, ASBrown, DGPhillips, CMischke, BVMolyneaux, JMFobian, YMHeasley, SEMoon, JBStallings, WCJoseph Rogier, DFox, DNPalmer, MJRinger, TRodriquez-Lens, MCubbage, JWBlevis-Bal, RMBenson, AGAcker, BAMaddux, TMTollefson, MBBond, BRMacinnes, AYu, Y Identification, synthesis and SAR of amino substituted pyrido[3,2b]pyrazinones as potent and selective PDE5 inhibitors. Bioorg Med Chem Lett19:4088-91 (2009) 
 
cGMP-specific 3',5'-cyclic phosphodiesterase
Name:cGMP-specific 3',5'-cyclic phosphodiesterase
Type:Protein
Mol. Mass.:99975.83
Organism:Homo sapiens (Human)
Description:O76074
Residue:875
BDBM50297805
NameBDBM50297805
Synonyms:4-(3,5-difluorobenzyl)-6-(4-fluorophenyl)-2-((tetrahydro-2H-pyran-4-yl)methylamino)pyrido[2,3-b]pyrazin-3(4H)-one | CHEMBL557059
TypeSmall organic molecule
Emp. Form.C26H23F3N4O2
Mol. Mass.480.4816
SMILESFc1ccc(cc1)-c1ccc2nc(NCC3CCOCC3)c(=O)n(Cc3cc(F)cc(F)c3)c2n1