Reaction Details
TargetcGMP-specific 3',5'-cyclic phosphodiesterase
LigandBDBM50296252
Substrate/Competitorn/a
Meas. Tech.ChEMBL_584078 (CHEMBL1058319)
IC50 2.4±n/a nM
Citation Owen, DRWalker, JKJon Jacobsen, EFreskos, JNHughes, ROBrown, DLBell, ASBrown, DGPhillips, CMischke, BVMolyneaux, JMFobian, YMHeasley, SEMoon, JBStallings, WCJoseph Rogier, DFox, DNPalmer, MJRinger, TRodriquez-Lens, MCubbage, JWBlevis-Bal, RMBenson, AGAcker, BAMaddux, TMTollefson, MBBond, BRMacinnes, AYu, Y Identification, synthesis and SAR of amino substituted pyrido[3,2b]pyrazinones as potent and selective PDE5 inhibitors. Bioorg Med Chem Lett19:4088-91 (2009) 
 
cGMP-specific 3',5'-cyclic phosphodiesterase
Name:cGMP-specific 3',5'-cyclic phosphodiesterase
Type:Protein
Mol. Mass.:99975.83
Organism:Homo sapiens (Human)
Description:O76074
Residue:875
BDBM50296252
NameBDBM50296252
Synonyms:6-(6-methoxypyridin-3-yl)-2-(2-morpholinoethylamino)-4-(2-propoxyethyl)pyrido[2,3-b]pyrazin-3(4H)-one 6-(6-methoxypyridin-3-yl)-2-[(2-morpholin-4-ylethyl)amino]-4-(2-propoxyethyl)pyrido[2,3-b]pyrazin-3(4H)-one | CHEMBL564374
TypeSmall organic molecule
Emp. Form.C24H32N6O4
Mol. Mass.468.5487
SMILESCCCOCCn1c2nc(ccc2nc(NCCN2CCOCC2)c1=O)-c1ccc(OC)nc1