Reaction Details
TargetAdenosine receptor A2a
LigandBDBM50051241
Substrate/Competitorn/a
Meas. Tech.ChEMBL_587703 (CHEMBL1037717)
Ki 1.2±n/a nM
Citation Michielan, LBolcato, CFederico, SCacciari, BBacilieri, MKlotz, KNKachler, SPastorin, GCardin, RSperduti, ASpalluto, GMoro, S Combining selectivity and affinity predictions using an integrated Support Vector Machine (SVM) approach: An alternative tool to discriminate between the human adenosine A(2A) and A(3) receptor pyrazolo-triazolo-pyrimidine antagonists binding sites. Bioorg Med Chem17:5259-74 (2009) 
 
Adenosine receptor A2a
Name:Adenosine receptor A2a
Type:G Protein-Coupled Receptor (GPCR)
Mol. Mass.:44716.46
Organism:Homo sapiens (Human)
Description:P29274
Residue:412
BDBM50051241
NameBDBM50051241
Synonyms:2-(furan-2-yl)-7-(3-phenylpropyl)-7H-pyrazolo[4,3-e][1,2,4]triazolo[1,5-c]pyrimidin-5-amine 2-Furan-2-yl-7-(3-phenyl-propyl)-7H-pyrazolo[4,3-e][1,2,4]triazolo[1,5-c]pyrimidin-5-ylamine(SCH 63390) SCH-63390
TypeSmall organic molecule
Emp. Form.C19H17N7O
Mol. Mass.359.3846
SMILESNc1nc2n(CCCc3ccccc3)ncc2c2nc(nn12)-c1ccco1