Reaction Details
TargetP2X purinoceptor 7
LigandBDBM50234965
Substrate/Competitorn/a
Meas. Tech.ChEMBL_588010 (CHEMBL1048345)
IC50 40±n/a nM
Citation Gunosewoyo, HCoster, MJBennett, MRKassiou, M Purinergic P2X(7) receptor antagonists: Chemistry and fundamentals of biological screening. Bioorg Med Chem17:4861-5 (2009) 
 
P2X purinoceptor 7
Name:P2X purinoceptor 7
Type:Protein
Mol. Mass.:68602.85
Organism:Homo sapiens (Human)
Description:Q99572
Residue:595
BDBM50234965
NameBDBM50234965
Synonyms:A-740003 N-(1-(2-cyano-3-(quinolin-5-yl)guanidino)-2,2-dimethylpropyl)-2-(3,4-dimethoxyphenyl)acetamide | N-(1-{[(Cyanoimino)(5-quinolinylamino)methyl]amino}-2,2-dimethylpropyl)-2-(3,4-dimethoxyphenyl)acetamide
TypeSmall organic molecule
Emp. Form.C26H30N6O3
Mol. Mass.474.5548
SMILESCOc1ccc(CC(=O)NC(N=C(NC#N)Nc2cccc3ncccc23)C(C)(C)C)cc1OC