Reaction Details
TargetDelta-type opioid receptor
LigandBDBM50039029
Substrate/Competitorn/a
Meas. Tech.ChEMBL_592556 (CHEMBL1046763)
EC50 166±n/a nM
Citation Purington, LCPogozheva, IDTraynor, JRMosberg, HI Pentapeptides displaying mu opioid receptor agonist and delta opioid receptor partial agonist/antagonist properties. J Med Chem52:7724-31 (2009) 
 
Delta-type opioid receptor
Name:Delta-type opioid receptor
Type:G Protein-Coupled Receptor (GPCR)
Mol. Mass.:40465.04
Organism:Rattus norvegicus (rat)
Description:Competition binding assays were using CHO-K1 cell membranes expressing the opioid receptor.
Residue:372
BDBM50039029
NameBDBM50039029
Synonyms:(+)-4-((alpha R)-((2S,5R)-4-allyl-2,5-dimethylpiperazin-1-yl)(3-methoxyphenyl)methyl)-N,N-diethylbenzamide 3-[(4-Allyl-2,5-dimethyl-piperazin-1-yl)-(4-diethylcarbamoyl-phenyl)-methyl]-benzoic acid 4-((R)-((2S,5R)-4-allyl-2,5-dimethylpiperazin-1-yl)(3-methoxyphenyl)methyl)-N,N-diethylbenzamide 4-[(4-Allyl-2,5-dimethyl-piperazin-1-yl)-(3-methoxy-phenyl)-methyl]-N,N-diethyl-benzamide (SNC 80) 4-[(R)-((2R,5S)-4-Allyl-2,5-dimethyl-piperazin-1-yl)-(3-methoxy-phenyl)-methyl]-N,N-diethyl-benzamide 4-[(R)-((R)-4-(S)-Allyl-2,5-dimethyl-piperazin-1-yl)-(3-methoxy-phenyl)-methyl]-N,N-diethyl-benzamide 4-[(R)-[(2S,5R)-4-allyl-2,5-dimethylpiperazin-1-yl](3-methoxyphenyl)-methyl]-N,N-diethylbenzamide SNC-80
TypeSmall organic molecule
Emp. Form.C28H39N3O2
Mol. Mass.449.6282
SMILESCCN(CC)C(=O)c1ccc(cc1)[C@@H](N1C[C@@H](C)N(CC=C)C[C@@H]1C)c1cccc(OC)c1