Reaction Details
TargetBeta-secretase 1
LigandBDBM50299240
Substrate/Competitorn/a
Meas. Tech.ChEMBL_589296 (CHEMBL1045676)
Ki 348±n/a nM
Citation Al-Tel, THAl-Qawasmeh, RASchmidt, MFAl-Aboudi, ARao, SNSabri, SSVoelter, W Rational design and synthesis of potent dibenzazepine motifs as beta-secretase inhibitors. J Med Chem52:6484-8 (2009) 
 
Beta-secretase 1
Name:Beta-secretase 1
Type:Protein
Mol. Mass.:55755.10
Organism:Homo sapiens (Human)
Description:P56817
Residue:501
BDBM50299240
NameBDBM50299240
Synonyms:3-(5-(Pyridin-4-yl)-1H-imidazol-2-yl)-5H dibenzo[b,e][1,4]-diazepin-11(10H)-one | CHEMBL575567
TypeSmall organic molecule
Emp. Form.C22H16N6O2
Mol. Mass.396.4014
SMILESO=C(Nc1nc(c[nH]1)-c1ccncc1)c1ccc2c(Nc3ccccc3NC2=O)c1