Reaction Details
TargetcAMP-specific 3',5'-cyclic phosphodiesterase 4D
LigandBDBM14361
Substrate/Competitorn/a
Meas. Tech.ChEMBL_591886 (CHEMBL1045956)
Ki 490±n/a nM
Citation Bruno, ORomussi, ASpallarossa, ABrullo, CSchenone, SBondavalli, FVanthuyne, NRoussel, C New selective phosphodiesterase 4D inhibitors differently acting on long, short, and supershort isoforms. J Med Chem52:6546-57 (2009) 
 
cAMP-specific 3',5'-cyclic phosphodiesterase 4D
Name:cAMP-specific 3',5'-cyclic phosphodiesterase 4D
Type:Protein
Mol. Mass.:91092.69
Organism:Homo sapiens (Human)
Description:Q08499
Residue:809
BDBM14361
NameBDBM14361
Synonyms:(R,S)-Rolipram 4-[3-(cyclopentyloxy)-4-methoxyphenyl]pyrrolidin-2-one CHEMBL63 | Rolipram
TypeSmall organic molecule
Emp. Form.C16H21NO3
Mol. Mass.275.3428
SMILESCOc1ccc(cc1OC1CCCC1)C1CNC(=O)C1