Reaction Details
TargetAdenosine receptor A3
LigandBDBM50299701
Substrate/Competitorn/a
Meas. Tech.ChEMBL_588680 (CHEMBL1056090)
Ki 0.44±n/a nM
Citation Volpini, RBuccioni, MDal Ben, DLambertucci, CLammi, CMarucci, GRamadori, ATKlotz, KNCristalli, G Synthesis and biological evaluation of 2-alkynyl-N6-methyl-5'-N-methylcarboxamidoadenosine derivatives as potent and highly selective agonists for the human adenosine A3 receptor. J Med Chem52:7897-900 (2009) 
 
Adenosine receptor A3
Name:Adenosine receptor A3
Type:G Protein-Coupled Receptor (GPCR)
Mol. Mass.:36197.32
Organism:Homo sapiens (Human)
Description:P0DMS8
Residue:318
BDBM50299701
NameBDBM50299701
Synonyms:CHEMBL574602 | N6-Methyl-2-phenylethynyl-5'-N-methylcarboxamidoadenosine
TypeSmall organic molecule
Emp. Form.C20H20N6O4
Mol. Mass.408.4106
SMILESCNC(=O)[C@H]1O[C@H]([C@H](O)[C@@H]1O)n1cnc2c(NC)nc(nc12)C#Cc1ccccc1