Reaction Details
TargetDelta-type opioid receptor
LigandBDBM50299731
Substrate/Competitorn/a
Meas. Tech.ChEMBL_588897 (CHEMBL1061221)
Ki 65±n/a nM
Citation Nieland, NPRennison, DBroadbear, JHPurington, LWoods, JHTraynor, JRLewis, JWHusbands, SM 14beta-Arylpropiolylamino-17-cyclopropylmethyl-7,8-dihydronormorphinones and related opioids. Further examples of pseudoirreversible mu opioid receptor antagonists. J Med Chem52:6926-30 (2009) 
 
Delta-type opioid receptor
Name:Delta-type opioid receptor
Type:G Protein-Coupled Receptor (GPCR)
Mol. Mass.:40382.98
Organism:Homo sapiens (Human)
Description:Competition binding assays were carried out using membrane preparations from transfected HN9.10 cells that constitutively expressed the delta opioid receptor.
Residue:372
BDBM50299731
NameBDBM50299731
Synonyms:CHEMBL578422 | N-Cyclopropylmethyl-14beta-[4'-chlorophenylpropioloylamino]-7,8-dihydronorcodeinone
TypeSmall organic molecule
Emp. Form.C30H29ClN2O4
Mol. Mass.517.015
SMILESCOc1ccc2C[C@H]3N(CC4CC4)CC[C@@]45[C@@H](Oc1c24)C(=O)CC[C@@]35NC(=O)C#Cc1ccc(Cl)cc1