Reaction Details
TargetMu-type opioid receptor
LigandBDBM50195678
Substrate/Competitorn/a
Meas. Tech.ChEMBL_588896 (CHEMBL1061220)
Ki 0.320000±n/a nM
Citation Nieland, NPRennison, DBroadbear, JHPurington, LWoods, JHTraynor, JRLewis, JWHusbands, SM 14beta-Arylpropiolylamino-17-cyclopropylmethyl-7,8-dihydronormorphinones and related opioids. Further examples of pseudoirreversible mu opioid receptor antagonists. J Med Chem52:6926-30 (2009) 
 
Mu-type opioid receptor
Name:Mu-type opioid receptor
Type:G Protein-Coupled Receptor (GPCR)
Mol. Mass.:44789.51
Organism:Homo sapiens (Human)
Description:P35372
Residue:400
BDBM50195678
NameBDBM50195678
Synonyms:(1R,5R,13R,17S)-17-{[(2E)-3-(4-chlorophenyl)prop-2-en-1-yl]amino}-4-(cyclopropylmethyl)-10-hydroxy-12-oxa-4-azapentacyclo[9.6.1.0^{1,13}.0^{5,17}.0^{7,18}]octadeca-7(18),8,10-trien-14-one | CHEMBL385482
TypeSmall organic molecule
Emp. Form.C29H31ClN2O3
Mol. Mass.491.021
SMILESOc1ccc2C[C@H]3N(CC4CC4)CC[C@@]45[C@@H](Oc1c24)C(=O)CC[C@@]35NC\C=C\c1ccc(Cl)cc1