Reaction Details
TargetMu-type opioid receptor
LigandBDBM50299729
Substrate/Competitorn/a
Meas. Tech.ChEMBL_588896 (CHEMBL1061220)
Ki 1.5±n/a nM
Citation Nieland, NPRennison, DBroadbear, JHPurington, LWoods, JHTraynor, JRLewis, JWHusbands, SM 14beta-Arylpropiolylamino-17-cyclopropylmethyl-7,8-dihydronormorphinones and related opioids. Further examples of pseudoirreversible mu opioid receptor antagonists. J Med Chem52:6926-30 (2009) 
 
Mu-type opioid receptor
Name:Mu-type opioid receptor
Type:G Protein-Coupled Receptor (GPCR)
Mol. Mass.:44789.51
Organism:Homo sapiens (Human)
Description:P35372
Residue:400
BDBM50299729
NameBDBM50299729
Synonyms:CHEMBL575451 | N-Cyclopropylmethyl-14beta-[phenylpropioloylamino]-7,8-dihydronorcodeinone
TypeSmall organic molecule
Emp. Form.C30H30N2O4
Mol. Mass.482.5702
SMILESCOc1ccc2C[C@H]3N(CC4CC4)CC[C@@]45[C@@H](Oc1c24)C(=O)CC[C@@]35NC(=O)C#Cc1ccccc1