Reaction Details
TargetNon-lysosomal glucosylceramidase
LigandBDBM50299753
Substrate/Competitorn/a
Meas. Tech.ChEMBL_589172 (CHEMBL1040323)
IC50>1000000±n/a nM
Citation Risseeuw, MDvan den Berg, RJDonker-Koopman, WEvan der Marel, GAAerts, JMOverhand, MOverkleeft, HS Synthesis and evaluation of D-gluco-pyranocyclopropyl amines as potential glucosidase inhibitors. Bioorg Med Chem Lett19:6600-3 (2009) 
 
Non-lysosomal glucosylceramidase
Name:Non-lysosomal glucosylceramidase
Type:PROTEIN
Mol. Mass.:104639.04
Organism:Homo sapiens (Human)
Description:ChEMBL_1435476
Residue:927
BDBM50299753
NameBDBM50299753
Synonyms:CHEMBL584580 | N-((1S,3R,4S,5R,6R,7S)-4,5-Dihydroxy-3-(hydroxymethyl)-2-oxabicyclo[4.1.0]heptan-7-yl)butyramide
TypeSmall organic molecule
Emp. Form.C11H19NO5
Mol. Mass.245.2723
SMILESCCCC(=O)N[C@@H]1[C@H]2O[C@H](CO)[C@@H](O)[C@H](O)[C@@H]12