Reaction Details
TargetSodium-dependent serotonin transporter
LigandBDBM50299801
Substrate/Competitorn/a
Meas. Tech.ChEMBL_589385 (CHEMBL1047380)
Ki 2±n/a nM
Citation Gray, DLXu, WCampbell, BMDounay, ABBarta, NBoroski, SDenny, LEvans, LStratman, NProbert, A Discovery and pharmacological characterization of aryl piperazine and piperidine ethers as dual acting norepinephrine reuptake inhibitors and 5-HT1A partial agonists. Bioorg Med Chem Lett19:6604-7 (2009) 
 
Sodium-dependent serotonin transporter
Name:Sodium-dependent serotonin transporter
Type:Multi-pass membrane protein
Mol. Mass.:70322.51
Organism:Homo sapiens (Human)
Description:P31645
Residue:630
BDBM50299801
NameBDBM50299801
Synonyms:4-(2-(3-fluorophenoxy)-4-methylphenyl)piperidine | CHEMBL573898
TypeSmall organic molecule
Emp. Form.C18H20FNO
Mol. Mass.285.3559
SMILESCc1ccc(C2CCNCC2)c(Oc2cccc(F)c2)c1