Reaction Details
TargetSodium-dependent noradrenaline transporter
LigandBDBM50299802
Substrate/Competitorn/a
Meas. Tech.ChEMBL_589383 (CHEMBL1047378)
Ki 5±n/a nM
Citation Gray, DLXu, WCampbell, BMDounay, ABBarta, NBoroski, SDenny, LEvans, LStratman, NProbert, A Discovery and pharmacological characterization of aryl piperazine and piperidine ethers as dual acting norepinephrine reuptake inhibitors and 5-HT1A partial agonists. Bioorg Med Chem Lett19:6604-7 (2009) 
 
Sodium-dependent noradrenaline transporter
Name:Sodium-dependent noradrenaline transporter
Type:Multi-pass membrane protein
Mol. Mass.:69337.72
Organism:Homo sapiens (Human)
Description:P23975
Residue:617
BDBM50299802
NameBDBM50299802
Synonyms:4-(3,4-dichlorophenyl)-2-(2-(piperazin-1-yl)benzyl)thiomorpholin-3-one | CHEMBL574126
TypeSmall organic molecule
Emp. Form.C21H23Cl2N3OS
Mol. Mass.436.398
SMILESClc1ccc(cc1Cl)N1CCSC(Cc2ccccc2N2CCNCC2)C1=O