Reaction Details
TargetSodium-dependent dopamine transporter
LigandBDBM50299804
Substrate/Competitorn/a
Meas. Tech.ChEMBL_589384 (CHEMBL1047379)
Ki 6±n/a nM
Citation Gray, DLXu, WCampbell, BMDounay, ABBarta, NBoroski, SDenny, LEvans, LStratman, NProbert, A Discovery and pharmacological characterization of aryl piperazine and piperidine ethers as dual acting norepinephrine reuptake inhibitors and 5-HT1A partial agonists. Bioorg Med Chem Lett19:6604-7 (2009) 
 
Sodium-dependent dopamine transporter
Name:Sodium-dependent dopamine transporter
Type:Multi-pass membrane protein
Mol. Mass.:68497.11
Organism:Homo sapiens (Human)
Description:Q01959
Residue:620
BDBM50299804
NameBDBM50299804
Synonyms:4-(2-fluoro-6-(4-fluorophenoxy)phenyl)piperidine | CHEMBL574231
TypeSmall organic molecule
Emp. Form.C17H17F2NO
Mol. Mass.289.3198
SMILESFc1ccc(Oc2cccc(F)c2C2CCNCC2)cc1