Reaction Details
Target5-hydroxytryptamine receptor 1A
LigandBDBM50299805
Substrate/Competitorn/a
Meas. Tech.ChEMBL_589382 (CHEMBL1047377)
Ki 9±n/a nM
Citation Gray, DLXu, WCampbell, BMDounay, ABBarta, NBoroski, SDenny, LEvans, LStratman, NProbert, A Discovery and pharmacological characterization of aryl piperazine and piperidine ethers as dual acting norepinephrine reuptake inhibitors and 5-HT1A partial agonists. Bioorg Med Chem Lett19:6604-7 (2009) 
 
5-hydroxytryptamine receptor 1A
Name:5-hydroxytryptamine receptor 1A
Type:n/a
Mol. Mass.:46122.49
Organism:Homo sapiens (Human)
Description:n/a
Residue:422
BDBM50299805
NameBDBM50299805
Synonyms:1-(2-(3-fluorophenoxy)phenyl)piperazine | CHEMBL573973
TypeSmall organic molecule
Emp. Form.C16H17FN2O
Mol. Mass.272.3174
SMILESFc1cccc(Oc2ccccc2N2CCNCC2)c1