Reaction Details
Target5-hydroxytryptamine receptor 1A
LigandBDBM50299808
Substrate/Competitorn/a
Meas. Tech.ChEMBL_589382 (CHEMBL1047377)
Ki 47±n/a nM
Citation Gray, DLXu, WCampbell, BMDounay, ABBarta, NBoroski, SDenny, LEvans, LStratman, NProbert, A Discovery and pharmacological characterization of aryl piperazine and piperidine ethers as dual acting norepinephrine reuptake inhibitors and 5-HT1A partial agonists. Bioorg Med Chem Lett19:6604-7 (2009) 
 
5-hydroxytryptamine receptor 1A
Name:5-hydroxytryptamine receptor 1A
Type:n/a
Mol. Mass.:46122.49
Organism:Homo sapiens (Human)
Description:n/a
Residue:422
BDBM50299808
NameBDBM50299808
Synonyms:4-(2-(2-fluorobenzyloxy)phenyl)piperidine | CHEMBL573897
TypeSmall organic molecule
Emp. Form.C18H20FNO
Mol. Mass.285.3559
SMILESFc1ccccc1COc1ccccc1C1CCNCC1