Reaction Details
TargetSodium-dependent noradrenaline transporter
LigandBDBM50299805
Substrate/Competitorn/a
Meas. Tech.ChEMBL_589383 (CHEMBL1047378)
Ki 1720±n/a nM
Citation Gray, DLXu, WCampbell, BMDounay, ABBarta, NBoroski, SDenny, LEvans, LStratman, NProbert, A Discovery and pharmacological characterization of aryl piperazine and piperidine ethers as dual acting norepinephrine reuptake inhibitors and 5-HT1A partial agonists. Bioorg Med Chem Lett19:6604-7 (2009) 
 
Sodium-dependent noradrenaline transporter
Name:Sodium-dependent noradrenaline transporter
Type:Multi-pass membrane protein
Mol. Mass.:69337.72
Organism:Homo sapiens (Human)
Description:P23975
Residue:617
BDBM50299805
NameBDBM50299805
Synonyms:1-(2-(3-fluorophenoxy)phenyl)piperazine | CHEMBL573973
TypeSmall organic molecule
Emp. Form.C16H17FN2O
Mol. Mass.272.3174
SMILESFc1cccc(Oc2ccccc2N2CCNCC2)c1