Reaction Details
Target5-hydroxytryptamine receptor 1A
LigandBDBM50299799
Substrate/Competitorn/a
Meas. Tech.ChEMBL_589382 (CHEMBL1047377)
Ki>4570±n/a nM
Citation Gray, DLXu, WCampbell, BMDounay, ABBarta, NBoroski, SDenny, LEvans, LStratman, NProbert, A Discovery and pharmacological characterization of aryl piperazine and piperidine ethers as dual acting norepinephrine reuptake inhibitors and 5-HT1A partial agonists. Bioorg Med Chem Lett19:6604-7 (2009) 
 
5-hydroxytryptamine receptor 1A
Name:5-hydroxytryptamine receptor 1A
Type:n/a
Mol. Mass.:46122.49
Organism:Homo sapiens (Human)
Description:n/a
Residue:422
BDBM50299799
NameBDBM50299799
Synonyms:4-(4,5-difluoro-2-(4-fluorophenoxy)phenyl)piperidine | CHEMBL574427
TypeSmall organic molecule
Emp. Form.C17H16F3NO
Mol. Mass.307.3102
SMILESFc1ccc(Oc2cc(F)c(F)cc2C2CCNCC2)cc1