Reaction Details
TargetPhosphatidylinositol 4,5-bisphosphate 3-kinase catalytic subunit alpha isoform
LigandBDBM35585
Substrate/Competitorn/a
Meas. Tech.ChEMBL_593490 (CHEMBL1047614)
IC50 100±n/a nM
Citation Zask, AKaplan, JVerheijen, JCRichard, DJCurran, KBrooijmans, NBennett, EMToral-Barza, LHollander, IAyral-Kaloustian, SYu, K Morpholine derivatives greatly enhance the selectivity of mammalian target of rapamycin (mTOR) inhibitors. J Med Chem52:7942-5 (2009) 
 
Phosphatidylinositol 4,5-bisphosphate 3-kinase catalytic subunit alpha isoform
Name:Phosphatidylinositol 4,5-bisphosphate 3-kinase catalytic subunit alpha isoform
Type:Enzyme Subunit
Mol. Mass.:124294.87
Organism:Homo sapiens (Human)
Description:P42336
Residue:1068
BDBM35585
NameBDBM35585
Synonyms:pyrazolo pyrimidine, 18
TypeSmall organic molecule
Emp. Form.C24H30N8O4
Mol. Mass.494.5462
SMILESCNC(=O)Nc1ccc(cc1)-c1nc(N2CCOCC2)c2cnn(C3CCN(CC3)C(=O)OC)c2n1