Reaction Details
Target5-hydroxytryptamine receptor 1A
LigandBDBM50300163
Substrate/Competitorn/a
Meas. Tech.ChEMBL_594165 (CHEMBL1038744)
Ki 10000±n/a nM
Citation Frecentese, FFiorino, FPerissutti, ESeverino, BMagli, EEsposito, ADe Angelis, FMassarelli, PNencini, CViti, BSantagada, VCaliendo, G Efficient microwave combinatorial synthesis of novel indolic arylpiperazine derivatives as serotoninergic ligands. Eur J Med Chem45:752-9 (2010) 
 
5-hydroxytryptamine receptor 1A
Name:5-hydroxytryptamine receptor 1A
Type:G Protein-Coupled Receptor (GPCR)
Mol. Mass.:46445.29
Organism:Rattus norvegicus (rat)
Description:Binding assays were performed using rat hippocampal membranes.
Residue:422
BDBM50300163
NameBDBM50300163
Synonyms:CHEMBL567834 | Ethyl 5-(3-(4-(2-cyanophenyl)piperazin-1-yl)propoxy)-1Hindole-2-carboxylate
TypeSmall organic molecule
Emp. Form.C25H28N4O3
Mol. Mass.432.5148
SMILESCCOC(=O)c1cc2cc(OCCCN3CCN(CC3)c3ccccc3C#N)ccc2[nH]1