Reaction Details
Target5-hydroxytryptamine receptor 2A
LigandBDBM50300159
Substrate/Competitorn/a
Meas. Tech.ChEMBL_594166 (CHEMBL1038745)
Ki 26.1±n/a nM
Citation Frecentese, FFiorino, FPerissutti, ESeverino, BMagli, EEsposito, ADe Angelis, FMassarelli, PNencini, CViti, BSantagada, VCaliendo, G Efficient microwave combinatorial synthesis of novel indolic arylpiperazine derivatives as serotoninergic ligands. Eur J Med Chem45:752-9 (2010) 
 
5-hydroxytryptamine receptor 2A
Name:5-hydroxytryptamine receptor 2A
Type:G Protein-Coupled Receptor (GPCR)
Mol. Mass.:52852.05
Organism:Rattus norvegicus (rat)
Description:Rat cortex membranes 5-HT2A receptors.
Residue:471
BDBM50300159
NameBDBM50300159
Synonyms:CHEMBL583422 | Ethyl 5-(3-(4-((benzo[d][1,3]dioxol-5-yl)methyl)piperazin-1-yl)propoxy)-1H-indole-2-carboxylate
TypeSmall organic molecule
Emp. Form.C26H31N3O5
Mol. Mass.465.5414
SMILESCCOC(=O)c1cc2cc(OCCCN3CCN(Cc4ccc5OCOc5c4)CC3)ccc2[nH]1