Reaction Details
Target5-hydroxytryptamine receptor 2C
LigandBDBM50300161
Substrate/Competitorn/a
Meas. Tech.ChEMBL_594167 (CHEMBL1039597)
Ki 10000±n/a nM
Citation Frecentese, FFiorino, FPerissutti, ESeverino, BMagli, EEsposito, ADe Angelis, FMassarelli, PNencini, CViti, BSantagada, VCaliendo, G Efficient microwave combinatorial synthesis of novel indolic arylpiperazine derivatives as serotoninergic ligands. Eur J Med Chem45:752-9 (2010) 
 
5-hydroxytryptamine receptor 2C
Name:5-hydroxytryptamine receptor 2C
Type:Enzyme
Mol. Mass.:51935.10
Organism:Rattus norvegicus (Rat)
Description:P08909
Residue:460
BDBM50300161
NameBDBM50300161
Synonyms:CHEMBL568285 | ethyl 5-(3-(4-(3,4-dichlorophenyl)piperazin-1-yl)propoxy)-1H-indole-2-carboxylate
TypeSmall organic molecule
Emp. Form.C24H27Cl2N3O3
Mol. Mass.476.395
SMILESCCOC(=O)c1cc2cc(OCCCN3CCN(CC3)c3ccc(Cl)c(Cl)c3)ccc2[nH]1