Reaction Details
TargetEctonucleotide pyrophosphatase/phosphodiesterase family member 2
LigandBDBM50300212
Substrate/Competitorn/a
Meas. Tech.ChEMBL_592904 (CHEMBL1048407)
Ki 700±n/a nM
Citation Hoeglund, ABBostic, HEHoward, ALWanjala, IWBest, MDBaker, DLParrill, AL Optimization of a pipemidic acid autotaxin inhibitor. J Med Chem53:1056-66 (2010) 
 
Ectonucleotide pyrophosphatase/phosphodiesterase family member 2
Name:Ectonucleotide pyrophosphatase/phosphodiesterase family member 2
Type:Enzyme
Mol. Mass.:99007.13
Organism:Homo sapiens (Human)
Description:Q13822
Residue:863
BDBM50300212
NameBDBM50300212
Synonyms:2-(4-{[(3-Trifluoromethylphenyl)amino]carbonothioyl}-1-piperazinyl)-8-ethyl-5-oxo-5,8-dihydropyrido[2,3-d]pyrimidine-6-carboxylic Acid | CHEMBL585744
TypeSmall organic molecule
Emp. Form.C22H21F3N6O3S
Mol. Mass.506.501
SMILESCCn1cc(C(O)=O)c(=O)c2cnc(nc12)N1CCN(CC1)C(=S)Nc1cccc(c1)C(F)(F)F