Reaction Details
TargetDelta-type opioid receptor
LigandBDBM50300375
Substrate/Competitorn/a
Meas. Tech.ChEMBL_591236 (CHEMBL1056141)
Ki 390±n/a nM
Citation Decker, MFulton, BSZhang, BKnapp, BIBidlack, JMNeumeyer, JL Univalent and bivalent ligands of butorphan: characteristics of the linking chain determine the affinity and potency of such opioid ligands. J Med Chem52:7389-96 (2009) 
 
Delta-type opioid receptor
Name:Delta-type opioid receptor
Type:G Protein-Coupled Receptor (GPCR)
Mol. Mass.:40382.98
Organism:Homo sapiens (Human)
Description:Competition binding assays were carried out using membrane preparations from transfected HN9.10 cells that constitutively expressed the delta opioid receptor.
Residue:372
BDBM50300375
NameBDBM50300375
Synonyms:2,2,9,9-Tetramethyldecanedioic Acid 10-((-)-N-Cyclobutylmethylmorphinan-3-yl)Ester | CHEMBL573918
TypeSmall organic molecule
Emp. Form.C35H53NO4
Mol. Mass.551.7996
SMILESCC(C)(CCCCCCC(C)(C)C(=O)Oc1ccc2C[C@@H]3[C@@H]4CCCC[C@]4(CCN3CC3CCC3)c2c1)C(O)=O