Reaction Details
TargetKappa-type opioid receptor
LigandBDBM50300372
Substrate/Competitorn/a
Meas. Tech.ChEMBL_591244 (CHEMBL1056149)
EC50 2.8±n/a nM
Citation Decker, MFulton, BSZhang, BKnapp, BIBidlack, JMNeumeyer, JL Univalent and bivalent ligands of butorphan: characteristics of the linking chain determine the affinity and potency of such opioid ligands. J Med Chem52:7389-96 (2009) 
 
Kappa-type opioid receptor
Name:Kappa-type opioid receptor
Type:G Protein-Coupled Receptor (GPCR)
Mol. Mass.:42648.76
Organism:Homo sapiens (Human)
Description:P41145
Residue:380
BDBM50300372
NameBDBM50300372
Synonyms:10-{[(1R,9R,10R)-17-(cyclobutylmethyl)-17-azatetracyclo[7.5.3.0^{1,10}.0^{2,7}]heptadeca-2,4,6-trien-4-yl]oxy}-10-oxodecanoic acid | CHEMBL566346
TypeSmall organic molecule
Emp. Form.C31H45NO4
Mol. Mass.495.6933
SMILESOC(=O)CCCCCCCCC(=O)Oc1ccc2C[C@@H]3[C@@H]4CCCC[C@]4(CCN3CC3CCC3)c2c1