Reaction Details
TargetDelta-type opioid receptor
LigandBDBM50300373
Substrate/Competitorn/a
Meas. Tech.ChEMBL_591236 (CHEMBL1056141)
Ki 20±n/a nM
Citation Decker, MFulton, BSZhang, BKnapp, BIBidlack, JMNeumeyer, JL Univalent and bivalent ligands of butorphan: characteristics of the linking chain determine the affinity and potency of such opioid ligands. J Med Chem52:7389-96 (2009) 
 
Delta-type opioid receptor
Name:Delta-type opioid receptor
Type:G Protein-Coupled Receptor (GPCR)
Mol. Mass.:40382.98
Organism:Homo sapiens (Human)
Description:Competition binding assays were carried out using membrane preparations from transfected HN9.10 cells that constitutively expressed the delta opioid receptor.
Residue:372
BDBM50300373
NameBDBM50300373
Synonyms:2,9-Dimethyldecanedioic Acid 10-((-)-N-Cyclobutylmethylmorphinan-3-yl)Ester | CHEMBL565679
TypeSmall organic molecule
Emp. Form.C33H49NO4
Mol. Mass.523.7465
SMILESCC(CCCCCCC(C)C(=O)Oc1ccc2C[C@@H]3[C@@H]4CCCC[C@]4(CCN3CC3CCC3)c2c1)C(O)=O