Reaction Details
TargetMu-type opioid receptor
LigandBDBM50300376
Substrate/Competitorn/a
Meas. Tech.ChEMBL_591235 (CHEMBL1056140)
Ki 8.6±n/a nM
Citation Decker, MFulton, BSZhang, BKnapp, BIBidlack, JMNeumeyer, JL Univalent and bivalent ligands of butorphan: characteristics of the linking chain determine the affinity and potency of such opioid ligands. J Med Chem52:7389-96 (2009) 
 
Mu-type opioid receptor
Name:Mu-type opioid receptor
Type:G Protein-Coupled Receptor (GPCR)
Mol. Mass.:44789.51
Organism:Homo sapiens (Human)
Description:P35372
Residue:400
BDBM50300376
NameBDBM50300376
Synonyms:Benzyl 17-((-)-N-Cyclobutylmethyl)morphinan-3-yl 2,2,9,9-Tetramethyldecane-dioate | CHEMBL575647
TypeSmall organic molecule
Emp. Form.C42H59NO4
Mol. Mass.641.9222
SMILESCC(C)(CCCCCCC(C)(C)C(=O)Oc1ccc2C[C@@H]3[C@@H]4CCCC[C@]4(CCN3CC3CCC3)c2c1)C(=O)OCc1ccccc1