Reaction Details
TargetMu-type opioid receptor
LigandBDBM50300381
Substrate/Competitorn/a
Meas. Tech.ChEMBL_591235 (CHEMBL1056140)
Ki 3.7±n/a nM
Citation Decker, MFulton, BSZhang, BKnapp, BIBidlack, JMNeumeyer, JL Univalent and bivalent ligands of butorphan: characteristics of the linking chain determine the affinity and potency of such opioid ligands. J Med Chem52:7389-96 (2009) 
 
Mu-type opioid receptor
Name:Mu-type opioid receptor
Type:G Protein-Coupled Receptor (GPCR)
Mol. Mass.:44789.51
Organism:Homo sapiens (Human)
Description:P35372
Residue:400
BDBM50300381
NameBDBM50300381
Synonyms:(5alpha)-17-Allyl-14-hydroxy-6-oxo-4,5-epoxymorphinan-3-yl-17-((-)-N-cyclobutylmethyl)morphinan-3-yl)2,9-Dimethyldecanedioate | CHEMBL584792
TypeSmall organic molecule
Emp. Form.C52H70N2O5
Mol. Mass.803.1226
SMILESCC(CCCCCCC(C)C(=O)Oc1ccc2CC3[C@@H]4CCC[C@@H]5Oc1c2[C@]45CCN3CC=C)C(=O)Oc1ccc2CC3[C@@H]4CCCC[C@]4(CCN3CC3CCC3)c2c1