Reaction Details
TargetKappa-type opioid receptor
LigandBDBM50300378
Substrate/Competitorn/a
Meas. Tech.ChEMBL_591244 (CHEMBL1056149)
EC50 6.4±n/a nM
Citation Decker, MFulton, BSZhang, BKnapp, BIBidlack, JMNeumeyer, JL Univalent and bivalent ligands of butorphan: characteristics of the linking chain determine the affinity and potency of such opioid ligands. J Med Chem52:7389-96 (2009) 
 
Kappa-type opioid receptor
Name:Kappa-type opioid receptor
Type:G Protein-Coupled Receptor (GPCR)
Mol. Mass.:42648.76
Organism:Homo sapiens (Human)
Description:P41145
Residue:380
BDBM50300378
NameBDBM50300378
Synonyms:Bis((-)-N-cyclobutylmethylmorphinan-3-yl)2,2,9,9-Tetramethyldecanedioate | CHEMBL584790
TypeSmall organic molecule
Emp. Form.C56H80N2O4
Mol. Mass.845.2454
SMILESCC(C)(CCCCCCC(C)(C)C(=O)Oc1ccc2C[C@@H]3[C@@H]4CCCC[C@]4(CCN3CC3CCC3)c2c1)C(=O)Oc1ccc2C[C@@H]3[C@@H]4CCCC[C@]4(CCN3CC3CCC3)c2c1