Reaction Details
TargetHistone acetyltransferase KAT2B
LigandBDBM50300425
Substrate/Competitorn/a
Meas. Tech.ChEMBL_591957 (CHEMBL1047520)
IC50 2600±n/a nM
Citation Ghizzoni, MHaisma, HJDekker, FJ Reactivity of isothiazolones and isothiazolone-1-oxides in the inhibition of the PCAF histone acetyltransferase. Eur J Med Chem44:4855-61 (2009) 
 
Histone acetyltransferase KAT2B
Name:Histone acetyltransferase KAT2B
Type:PROTEIN
Mol. Mass.:93045.76
Organism:Homo sapiens (Human)
Description:ChEMBL_1502838
Residue:832
BDBM50300425
NameBDBM50300425
Synonyms:CHEMBL573028 | Methyl 3-(4,5-dichloro-3-oxoisothiazol-2(3H)-yl)propanoate
TypeSmall organic molecule
Emp. Form.C7H7Cl2NO3S
Mol. Mass.256.106
SMILESCOC(=O)CCn1sc(Cl)c(Cl)c1=O