Reaction Details
TargetHistone deacetylase 1
LigandBDBM50207561
Substrate/Competitorn/a
Meas. Tech.ChEMBL_591997 (CHEMBL1048394)
IC50>10000±n/a nM
Citation Tessier, PSmil, DVWahhab, ALeit, SRahil, JLi, ZDéziel, RBesterman, JM Diphenylmethylene hydroxamic acids as selective class IIa histone deacetylase inhibitors. Bioorg Med Chem Lett19:5684-8 (2009) 
 
Histone deacetylase 1
Name:Histone deacetylase 1
Type:Enzyme
Mol. Mass.:55090.27
Organism:Homo sapiens (Human)
Description:Q13547
Residue:482
BDBM50207561
NameBDBM50207561
Synonyms:CHEMBL396097 N-hydroxy-2,2-diphenylacetamide
TypeSmall organic molecule
Emp. Form.C14H13NO2
Mol. Mass.227.2585
SMILESONC(=O)C(c1ccccc1)c1ccccc1