Reaction Details
TargetHistone deacetylase 4
LigandBDBM50300445
Substrate/Competitorn/a
Meas. Tech.ChEMBL_591999 (CHEMBL1050114)
IC50 1910±n/a nM
Citation Tessier, PSmil, DVWahhab, ALeit, SRahil, JLi, ZDéziel, RBesterman, JM Diphenylmethylene hydroxamic acids as selective class IIa histone deacetylase inhibitors. Bioorg Med Chem Lett19:5684-8 (2009) 
 
Histone deacetylase 4
Name:Histone deacetylase 4
Type:Enzyme
Mol. Mass.:119049.39
Organism:Homo sapiens (Human)
Description:P56524
Residue:1084
BDBM50300445
NameBDBM50300445
Synonyms:CHEMBL572545 | N-hydroxy-10-methyl-9,10-dihydroacridine-9-carboxamide
TypeSmall organic molecule
Emp. Form.C15H14N2O2
Mol. Mass.254.2839
SMILESCN1c2ccccc2C(C(=O)NO)c2ccccc12