Reaction Details
TargetHistone deacetylase 4
LigandBDBM50300447
Substrate/Competitorn/a
Meas. Tech.ChEMBL_591999 (CHEMBL1050114)
IC50 2320±n/a nM
Citation Tessier, PSmil, DVWahhab, ALeit, SRahil, JLi, ZDéziel, RBesterman, JM Diphenylmethylene hydroxamic acids as selective class IIa histone deacetylase inhibitors. Bioorg Med Chem Lett19:5684-8 (2009) 
 
Histone deacetylase 4
Name:Histone deacetylase 4
Type:Enzyme
Mol. Mass.:119049.39
Organism:Homo sapiens (Human)
Description:P56524
Residue:1084
BDBM50300447
NameBDBM50300447
Synonyms:CHEMBL575482 | N-hydroxy-9,10-dihydroanthracene-9-carboxamide
TypeSmall organic molecule
Emp. Form.C15H13NO2
Mol. Mass.239.2692
SMILESONC(=O)C1c2ccccc2Cc2ccccc12