Reaction Details
TargetCannabinoid receptor 2
LigandBDBM50300455
Substrate/Competitorn/a
Meas. Tech.ChEMBL_592011 (CHEMBL1050126)
Ki 318±n/a nM
Citation Lange, JHden Hartog, APvan der Neut, MAvan Vliet, BJKruse, CG Synthesis and SAR of 1,4,5,6-tetrahydropyridazines as potent cannabinoid CB1 receptor antagonists. Bioorg Med Chem Lett19:5675-8 (2009) 
 
Cannabinoid receptor 2
Name:Cannabinoid receptor 2
Type:G Protein-Coupled Receptor (GPCR)
Mol. Mass.:39690.94
Organism:Homo sapiens (Human)
Description:P34972
Residue:360
BDBM50300455
NameBDBM50300455
Synonyms:3-(4-chlorophenyl)-N'-(4-chlorophenylsulfonyl)-N-methyl-4-phenyl-5,6-dihydropyridazine-1(4H)-carboximidamide | CHEMBL577384
TypeSmall organic molecule
Emp. Form.C24H22Cl2N4O2S
Mol. Mass.501.428
SMILESCN=C(NS(=O)(=O)c1ccc(Cl)cc1)N1CCC(C(=N1)c1ccc(Cl)cc1)c1ccccc1