Reaction Details
TargetMuscarinic acetylcholine receptor M1
LigandBDBM46858
Substrate/Competitorn/a
Meas. Tech.ChEMBL_588764 (CHEMBL1054450)
Ki 86000±n/a nM
Citation Sadashiva, CTChandra, JNKavitha, CVThimmegowda, ASubhash, MNRangappa, KS Synthesis and pharmacological evaluation of novel N-alkyl/aryl substituted thiazolidinone arecoline analogues as muscarinic receptor 1 agonist in Alzheimer's dementia models. Eur J Med Chem44:4848-54 (2009) 
 
Muscarinic acetylcholine receptor M1
Name:Muscarinic acetylcholine receptor M1
Type:Enzyme Catalytic Domain
Mol. Mass.:51390.46
Organism:RAT
Description:P08482
Residue:460
BDBM46858
NameBDBM46858
Synonyms:1-methyl-3,6-dihydro-2H-pyridine-5-carboxylic acid methyl ester;hydrobromide ARECOLINE HYDROBROMIDE SMR000058258 cid_9301 | methyl 1-methyl-3,6-dihydro-2H-pyridine-5-carboxylate;hydrobromide
TypeSmall organic molecule
Emp. Form.C8H13NO2
Mol. Mass.155.1943
SMILESCOC(=O)C1=CCCN(C)C1