Reaction Details
TargetNuclear receptor subfamily 1 group I member 2
LigandBDBM19992
Substrate/Competitorn/a
Meas. Tech.ChEMBL_588964 (CHEMBL1056159)
Ki 2000±n/a nM
Citation Marino, JPKallander, LSMa, COh, HJLee, DGaitanopoulos, DEKrawiec, JAParks, DJWebb, CLZiegler, KJaye, MThompson, SK The discovery of tertiary-amine LXR agonists with potent cholesterol efflux activity in macrophages. Bioorg Med Chem Lett19:5617-21 (2009) 
 
Nuclear receptor subfamily 1 group I member 2
Name:Nuclear receptor subfamily 1 group I member 2
Type:Nuclear receptor
Mol. Mass.:49774.77
Organism:Homo sapiens (Human)
Description:O75469
Residue:434
BDBM19992
NameBDBM19992
Synonyms:2-[3-[3-[[2-chloro-3-(trifluoromethyl)phenyl]methyl-[2,2-di(phenyl)ethyl]amino]propoxy]phenyl]acetic acid CHEMBL59030 GW3965 US10669296, Compound GW3965 | US10945978, Compound 2
TypeSmall organic molecule
Emp. Form.C33H31ClF3NO3
Mol. Mass.582.052
SMILESOC(=O)Cc1cccc(OCCCN(CC(c2ccccc2)c2ccccc2)Cc2cccc(c2Cl)C(F)(F)F)c1